Reaction Details
TargetLysine-specific histone demethylase 1A
LigandBDBM113745
Substrate/Competitorn/a
Meas. Tech.GST-LSD1 Enzymatic Assays
pH7.5±n/a
Ki 138± 48 nM
Commentsextracted
Citation Prusevich, PKalin, JHMing, SABasso, MGivens, JLi, XHu, JTaylor, MSCieniewicz, AMHsiao, PYHuang, RRoberson, HAdejola, NAvery, LBCasero, RATaverna, SDQian, JTackett, AJRatan, RRMcDonald, OGFeinberg, APCole, PA A Selective Phenelzine Analogue Inhibitor of Histone Demethylase LSD1. ACS Chem Biol9:1284-93 (2014) 
 
Lysine-specific histone demethylase 1A
Name:Lysine-specific histone demethylase 1A
Type:Enzyme
Mol. Mass.:92901.01
Organism:Homo sapiens (Human)
Description:O60341
Residue:852
BDBM113745
NameBDBM113745
Synonyms:4-(4-Fluorophenyl)-N-[4-(2-hydrazinylethyl)phenyl]butanamide sulfate salt (12g)
TypeSmall organic molecule
Emp. Form.C18H22FN3O
Mol. Mass.315.3852
SMILESNNCCc1ccc(NC(=O)CCCc2ccc(F)cc2)cc1