Reaction Details
TargetLysine-specific histone demethylase 1A
LigandBDBM113746
Substrate/Competitorn/a
Meas. Tech.GST-LSD1 Enzymatic Assays
pH7.5±n/a
Ki 207± 89 nM
Commentsextracted
Citation Prusevich, PKalin, JHMing, SABasso, MGivens, JLi, XHu, JTaylor, MSCieniewicz, AMHsiao, PYHuang, RRoberson, HAdejola, NAvery, LBCasero, RATaverna, SDQian, JTackett, AJRatan, RRMcDonald, OGFeinberg, APCole, PA A Selective Phenelzine Analogue Inhibitor of Histone Demethylase LSD1. ACS Chem Biol9:1284-93 (2014) 
 
Lysine-specific histone demethylase 1A
Name:Lysine-specific histone demethylase 1A
Type:Enzyme
Mol. Mass.:92901.01
Organism:Homo sapiens (Human)
Description:O60341
Residue:852
BDBM113746
NameBDBM113746
Synonyms:N-[4-(2-Hydrazinylethyl)phenyl]-4-(4-methoxyphenyl)butanamide sulfate salt (12h)
TypeSmall organic molecule
Emp. Form.C19H25N3O2
Mol. Mass.327.4207
SMILESCOc1ccc(CCCC(=O)Nc2ccc(CCNN)cc2)cc1