Reaction Details
TargetLysine-specific histone demethylase 1A
LigandBDBM113755
Substrate/Competitorn/a
Meas. Tech.GST-LSD1 Enzymatic Assays
pH7.5±n/a
Ki 1.6e+3± 4.9e+2 nM
Commentsextracted
Citation Prusevich, PKalin, JHMing, SABasso, MGivens, JLi, XHu, JTaylor, MSCieniewicz, AMHsiao, PYHuang, RRoberson, HAdejola, NAvery, LBCasero, RATaverna, SDQian, JTackett, AJRatan, RRMcDonald, OGFeinberg, APCole, PA A Selective Phenelzine Analogue Inhibitor of Histone Demethylase LSD1. ACS Chem Biol9:1284-93 (2014) 
 
Lysine-specific histone demethylase 1A
Name:Lysine-specific histone demethylase 1A
Type:Enzyme
Mol. Mass.:92901.01
Organism:Homo sapiens (Human)
Description:O60341
Residue:852
BDBM113755
NameBDBM113755
Synonyms:N-Benzyl-N-[4-(2-hydrazinylethyl)phenyl]-4-phenylbutanamide oxalate salt (12m)
TypeSmall organic molecule
Emp. Form.C25H29N3O
Mol. Mass.387.5173
SMILESNNCCc1ccc(cc1)N(Cc1ccccc1)C(=O)CCCc1ccccc1