Reaction Details
TargetAmine oxidase [flavin-containing] A
LigandBDBM113742
Substrate/Competitorn/a
Meas. Tech.MAO-A/B Activity and Inhibition Assay
pH7.5±n/a
Ki 2.6e+3± 2.3e+3 nM
Commentsextracted
Citation Prusevich, PKalin, JHMing, SABasso, MGivens, JLi, XHu, JTaylor, MSCieniewicz, AMHsiao, PYHuang, RRoberson, HAdejola, NAvery, LBCasero, RATaverna, SDQian, JTackett, AJRatan, RRMcDonald, OGFeinberg, APCole, PA A Selective Phenelzine Analogue Inhibitor of Histone Demethylase LSD1. ACS Chem Biol9:1284-93 (2014) 
 
Amine oxidase [flavin-containing] A
Name:Amine oxidase [flavin-containing] A
Type:Protein
Mol. Mass.:59689.53
Organism:Homo sapiens (Human)
Description:P21397
Residue:527
BDBM113742
NameBDBM113742
Synonyms:N-[4-(2-Hydrazinylethyl)phenyl]-4-phenylbutanamide dihydrochloride salt (12d)
TypeSmall organic molecule
Emp. Form.C18H23N3O
Mol. Mass.297.3947
SMILESNNCCc1ccc(NC(=O)CCCc2ccccc2)cc1