Reaction Details
TargetSerine/threonine-protein kinase mTOR
LigandBDBM116006
Substrate/Competitorn/a
Meas. Tech.mTOR Kinase Activity Assay
IC50 0.71±n/a nM
Citation Schneider, SKessler, Dvan der Veen, LWunberg, T 5-alkynyl-pyrimidines US Patent US8633183 Publication Date 1/21/2014
 
Serine/threonine-protein kinase mTOR
Name:Serine/threonine-protein kinase mTOR
Type:Rapamycin target protein
Mol. Mass.:288917.12
Organism:Homo sapiens (Human)
Description:P42345
Residue:2549
BDBM116006
NameBDBM116006
Synonyms:US8633183, E-155
TypeSmall organic molecule
Emp. Form.C28H30ClFN6O3S
Mol. Mass.585.093
SMILESCCc1ncnc(-c2cc(F)c(C(=O)N3CCN(CCCS(C)(=O)=O)CC3)c(Cl)c2)c1C#Cc1ccc(N)nc1