Reaction Details
TargetSerine/threonine-protein kinase mTOR
LigandBDBM116097
Substrate/Competitorn/a
Meas. Tech.mTOR Kinase Activity Assay
IC50 0.8±n/a nM
Citation Schneider, SKessler, Dvan der Veen, LWunberg, T 5-alkynyl-pyrimidines US Patent US8633183 Publication Date 1/21/2014
 
Serine/threonine-protein kinase mTOR
Name:Serine/threonine-protein kinase mTOR
Type:Rapamycin target protein
Mol. Mass.:288917.12
Organism:Homo sapiens (Human)
Description:P42345
Residue:2549
BDBM116097
NameBDBM116097
Synonyms:US8633183, E-247
TypeSmall organic molecule
Emp. Form.C27H24FN7O
Mol. Mass.481.5242
SMILESCCc1ncnc(-c2ccc(C(=O)N3CCn4c(C)cnc4C3)c(F)c2)c1C#Cc1ccc(N)nc1