Reaction Details
TargetSerine/threonine-protein kinase mTOR
LigandBDBM116102
Substrate/Competitorn/a
Meas. Tech.mTOR Kinase Activity Assay
IC50 0.57±n/a nM
Citation Schneider, SKessler, Dvan der Veen, LWunberg, T 5-alkynyl-pyrimidines US Patent US8633183 Publication Date 1/21/2014
 
Serine/threonine-protein kinase mTOR
Name:Serine/threonine-protein kinase mTOR
Type:Rapamycin target protein
Mol. Mass.:288917.12
Organism:Homo sapiens (Human)
Description:P42345
Residue:2549
BDBM116102
NameBDBM116102
Synonyms:US8633183, E-252
TypeSmall organic molecule
Emp. Form.C28H29ClN6O
Mol. Mass.501.022
SMILESCCc1ncnc(-c2ccc(C(=O)N3CCN(CC3)C3CCC3)c(Cl)c2)c1C#Cc1ccc(N)nc1