Reaction Details
TargetSerine/threonine-protein kinase mTOR
LigandBDBM116156
Substrate/Competitorn/a
Meas. Tech.mTOR Kinase Activity Assay
IC50 0.76±n/a nM
Citation Schneider, SKessler, Dvan der Veen, LWunberg, T 5-alkynyl-pyrimidines US Patent US8633183 Publication Date 1/21/2014
 
Serine/threonine-protein kinase mTOR
Name:Serine/threonine-protein kinase mTOR
Type:Rapamycin target protein
Mol. Mass.:288917.12
Organism:Homo sapiens (Human)
Description:P42345
Residue:2549
BDBM116156
NameBDBM116156
Synonyms:US8633183, E-310
TypeSmall organic molecule
Emp. Form.C28H30ClFN6O3
Mol. Mass.553.028
SMILESCCc1ncnc(-c2cc(F)c(C(=O)N3CCN(CCOCCO)CC3)c(Cl)c2)c1C#Cc1ccc(N)nc1