Reaction Details
TargetTyrosine-protein kinase JAK3
LigandBDBM116315
Substrate/Competitorn/a
Meas. Tech.JAK3 Inhibition Assay
pH7.2±n/a
Temperature295.15±n/a K
Ki 1.7±n/a nM
Commentsextracted
Citation Blaney, JGibbons, PAHanan, ELyssikatos, JPMagnuson, SRPastor, RRawson, TEZhou, AZhu, B Pyrazolopyrimidine JAK inhibitor compounds and methods US Patent US8637526 Publication Date 1/28/2014
 
Tyrosine-protein kinase JAK3
Name:Tyrosine-protein kinase JAK3
Type:Protein
Mol. Mass.:125111.08
Organism:Homo sapiens (Human)
Description:P52333
Residue:1124
BDBM116315
NameBDBM116315
Synonyms:US8637526, 248
TypeSmall organic molecule
Emp. Form.C16H11Cl2N7O
Mol. Mass.388.211
SMILESNc1ccn2ncc(C(=O)Nc3c[nH]nc3-c3cc(Cl)ccc3Cl)c2n1