Reaction Details
TargetRibosomal protein S6 kinase beta-1
LigandBDBM116435
Substrate/Competitorn/a
Meas. Tech.Enzyme Assay
pH7.5±n/a
Temperature298.15±n/a K
IC50 0.5±n/a nM
Commentsextracted
Citation Sutton, AELan, RRichardson, TEPerrey, DVandeveer, HGHuck, BRKarra, SRChen, XXiao, YLiu-Bujalski, LGoutopoulos, AStieber, FHodous, BLQiu, HJones, RHeasley, BH Amino azaheterocyclic carboxamides US Patent US8637532 Publication Date 1/28/2014
 
Ribosomal protein S6 kinase beta-1
Name:Ribosomal protein S6 kinase beta-1
Type:Enzyme
Mol. Mass.:59139.89
Organism:Homo sapiens (Human)
Description:His-tagged S6K1.
Residue:525
BDBM116435
NameBDBM116435
Synonyms:US8637532, 116
TypeSmall organic molecule
Emp. Form.C17H16FN5O
Mol. Mass.325.3402
SMILESNCC(Nc1ncnc2c(cccc12)C(N)=O)c1cccc(F)c1