Reaction Details
TargetAurora kinase A
LigandBDBM116559
Substrate/Competitorn/a
Meas. Tech.Enzyme Assay
IC50 0.12±n/a nM
Citation Sutton, AELan, RRichardson, TEPerrey, DVandeveer, HGHuck, BRKarra, SRChen, XXiao, YLiu-Bujalski, LGoutopoulos, AStieber, FHodous, BLQiu, HJones, RHeasley, BH Amino azaheterocyclic carboxamides US Patent US8637532 Publication Date 1/28/2014
 
Aurora kinase A
Name:Aurora kinase A
Type:Serine/threonine-protein kinase
Mol. Mass.:45830.98
Organism:Homo sapiens (Human)
Description:O14965
Residue:403
BDBM116559
NameBDBM116559
Synonyms:US8637532, 250
TypeSmall organic molecule
Emp. Form.C23H17Cl2N5O2
Mol. Mass.466.319
SMILESNC(=O)c1cccc2c(NCc3cccc(NC(=O)c4ccc(Cl)cc4Cl)c3)ncnc12