Reaction Details
TargetAurora kinase A
LigandBDBM116622
Substrate/Competitorn/a
Meas. Tech.Enzyme Assay
IC50 0.05±n/a nM
Citation Sutton, AELan, RRichardson, TEPerrey, DVandeveer, HGHuck, BRKarra, SRChen, XXiao, YLiu-Bujalski, LGoutopoulos, AStieber, FHodous, BLQiu, HJones, RHeasley, BH Amino azaheterocyclic carboxamides US Patent US8637532 Publication Date 1/28/2014
 
Aurora kinase A
Name:Aurora kinase A
Type:Serine/threonine-protein kinase
Mol. Mass.:45830.98
Organism:Homo sapiens (Human)
Description:O14965
Residue:403
BDBM116622
NameBDBM116622
Synonyms:US8637532, 319
TypeSmall organic molecule
Emp. Form.C26H24BrN5O3
Mol. Mass.534.404
SMILESCOCCC(Nc1ncnc2c(cccc12)C(N)=O)c1cccc(NC(=O)c2ccc(Br)cc2)c1