Reaction Details
TargetAurora kinase A
LigandBDBM116639
Substrate/Competitorn/a
Meas. Tech.Enzyme Assay
IC50 0.09±n/a nM
Citation Sutton, AELan, RRichardson, TEPerrey, DVandeveer, HGHuck, BRKarra, SRChen, XXiao, YLiu-Bujalski, LGoutopoulos, AStieber, FHodous, BLQiu, HJones, RHeasley, BH Amino azaheterocyclic carboxamides US Patent US8637532 Publication Date 1/28/2014
 
Aurora kinase A
Name:Aurora kinase A
Type:Serine/threonine-protein kinase
Mol. Mass.:45830.98
Organism:Homo sapiens (Human)
Description:O14965
Residue:403
BDBM116639
NameBDBM116639
Synonyms:US8637532, 338
TypeSmall organic molecule
Emp. Form.C26H25N5O4
Mol. Mass.471.5078
SMILESCOc1ccc(cc1)C(=O)Nc1cccc(c1)C(CCO)Nc1ncnc2c(cccc12)C(N)=O