Reaction Details
TargetAurora kinase A
LigandBDBM116652
Substrate/Competitorn/a
Meas. Tech.Enzyme Assay
IC50 0.08±n/a nM
Citation Sutton, AELan, RRichardson, TEPerrey, DVandeveer, HGHuck, BRKarra, SRChen, XXiao, YLiu-Bujalski, LGoutopoulos, AStieber, FHodous, BLQiu, HJones, RHeasley, BH Amino azaheterocyclic carboxamides US Patent US8637532 Publication Date 1/28/2014
 
Aurora kinase A
Name:Aurora kinase A
Type:Serine/threonine-protein kinase
Mol. Mass.:45830.98
Organism:Homo sapiens (Human)
Description:O14965
Residue:403
BDBM116652
NameBDBM116652
Synonyms:US8637532, 352
TypeSmall organic molecule
Emp. Form.C23H19N7O
Mol. Mass.409.4433
SMILESC[C@@H](Nc1ncnc2c(cccc12)C(N)=O)c1cccc(Nc2cc(ccn2)C#N)c1