Reaction Details
TargetAurora kinase A
LigandBDBM116730
Substrate/Competitorn/a
Meas. Tech.Enzyme Assay
IC50 0.13±n/a nM
Citation Sutton, AELan, RRichardson, TEPerrey, DVandeveer, HGHuck, BRKarra, SRChen, XXiao, YLiu-Bujalski, LGoutopoulos, AStieber, FHodous, BLQiu, HJones, RHeasley, BH Amino azaheterocyclic carboxamides US Patent US8637532 Publication Date 1/28/2014
 
Aurora kinase A
Name:Aurora kinase A
Type:Serine/threonine-protein kinase
Mol. Mass.:45830.98
Organism:Homo sapiens (Human)
Description:O14965
Residue:403
BDBM116730
NameBDBM116730
Synonyms:US8637532, 440
TypeSmall organic molecule
Emp. Form.C25H22FN5O3
Mol. Mass.459.4723
SMILESCOc1ccc(cc1F)C(=O)Nc1cccc(c1)[C@@H](C)Nc1ncnc2c(cccc12)C(N)=O