Reaction Details
TargetAurora kinase A
LigandBDBM116811
Substrate/Competitorn/a
Meas. Tech.Enzyme Assay
IC50 0.04±n/a nM
Citation Sutton, AELan, RRichardson, TEPerrey, DVandeveer, HGHuck, BRKarra, SRChen, XXiao, YLiu-Bujalski, LGoutopoulos, AStieber, FHodous, BLQiu, HJones, RHeasley, BH Amino azaheterocyclic carboxamides US Patent US8637532 Publication Date 1/28/2014
 
Aurora kinase A
Name:Aurora kinase A
Type:Serine/threonine-protein kinase
Mol. Mass.:45830.98
Organism:Homo sapiens (Human)
Description:O14965
Residue:403
BDBM116811
NameBDBM116811
Synonyms:US8637532, 537
TypeSmall organic molecule
Emp. Form.C21H19F2N5O2
Mol. Mass.411.4047
SMILESC[C@@H](Nc1ncnc2c(cccc12)C(N)=O)c1cccc(NC(=O)C2CC2(F)F)c1