Reaction Details
TargetAurora kinase A
LigandBDBM116813
Substrate/Competitorn/a
Meas. Tech.Enzyme Assay
IC50 0.15±n/a nM
Citation Sutton, AELan, RRichardson, TEPerrey, DVandeveer, HGHuck, BRKarra, SRChen, XXiao, YLiu-Bujalski, LGoutopoulos, AStieber, FHodous, BLQiu, HJones, RHeasley, BH Amino azaheterocyclic carboxamides US Patent US8637532 Publication Date 1/28/2014
 
Aurora kinase A
Name:Aurora kinase A
Type:Serine/threonine-protein kinase
Mol. Mass.:45830.98
Organism:Homo sapiens (Human)
Description:O14965
Residue:403
BDBM116813
NameBDBM116813
Synonyms:US8637532, 539
TypeSmall organic molecule
Emp. Form.C21H18N6O
Mol. Mass.370.4072
SMILESNC(=O)c1cccc2c(NCc3cccc(Nc4ccccn4)c3)ncnc12