Reaction Details
TargetAurora kinase A
LigandBDBM116918
Substrate/Competitorn/a
Meas. Tech.Enzyme Assay
IC50 0.12±n/a nM
Citation Sutton, AELan, RRichardson, TEPerrey, DVandeveer, HGHuck, BRKarra, SRChen, XXiao, YLiu-Bujalski, LGoutopoulos, AStieber, FHodous, BLQiu, HJones, RHeasley, BH Amino azaheterocyclic carboxamides US Patent US8637532 Publication Date 1/28/2014
 
Aurora kinase A
Name:Aurora kinase A
Type:Serine/threonine-protein kinase
Mol. Mass.:45830.98
Organism:Homo sapiens (Human)
Description:O14965
Residue:403
BDBM116918
NameBDBM116918
Synonyms:US8637532, 645
TypeSmall organic molecule
Emp. Form.C23H23N7O2
Mol. Mass.429.4744
SMILESCC(C)c1cc([nH]n1)C(=O)Nc1cccc(CNc2ncnc3c(cccc23)C(N)=O)c1