Reaction Details
TargetAurora kinase A
LigandBDBM116938
Substrate/Competitorn/a
Meas. Tech.Enzyme Assay
IC50 0.08±n/a nM
Citation Sutton, AELan, RRichardson, TEPerrey, DVandeveer, HGHuck, BRKarra, SRChen, XXiao, YLiu-Bujalski, LGoutopoulos, AStieber, FHodous, BLQiu, HJones, RHeasley, BH Amino azaheterocyclic carboxamides US Patent US8637532 Publication Date 1/28/2014
 
Aurora kinase A
Name:Aurora kinase A
Type:Serine/threonine-protein kinase
Mol. Mass.:45830.98
Organism:Homo sapiens (Human)
Description:O14965
Residue:403
BDBM116938
NameBDBM116938
Synonyms:US8637532, 665
TypeSmall organic molecule
Emp. Form.C27H28N6O3
Mol. Mass.484.5496
SMILESNC(=O)c1cccc2c(NCc3cccc(NC(=O)C4=CCC(C=C4)N4CCOCC4)c3)ncnc12