Reaction Details
TargetTGF-beta receptor type-1
LigandBDBM282906
Substrate/Competitorn/a
Meas. Tech.Biological Assay
pH7.4±n/a
Temperature298.15±n/a K
IC50 0.800±n/a nM
Commentsextracted
Citation Kinsella, TGelman, MHong, HDarwish, ISSingh, RYu, JBorzilleri, RMVelaparthi, ULiu, PDarne, CRahaman, HWarrier, JS TGF-beta inhibitors US Patent US9884868 Publication Date 2/6/2018
 
TGF-beta receptor type-1
Name:TGF-beta receptor type-1
Type:enzyme
Mol. Mass.:55968.24
Organism:Homo sapiens (Human)
Description:P36897
Residue:503
BDBM282906
NameBDBM282906
Synonyms:6-(1-(2-fluoroethyl)-4-(4-fluorophenyl)-1H-imidazol-5- yl)imidazo[1,2-b]pyridazine-3-carboxamide US9884868, Example 111'
TypeSmall organic molecule
Emp. Form.C18H14F2N6O
Mol. Mass.368.3402
SMILESNC(=O)c1cnc2ccc(nn12)-c1c(ncn1CCF)-c1ccc(F)cc1