Reaction Details
TargetTGF-beta receptor type-1
LigandBDBM282907
Substrate/Competitorn/a
Meas. Tech.Biological Assay
pH7.4±n/a
Temperature298.15±n/a K
IC50 0.700±n/a nM
Commentsextracted
Citation Kinsella, TGelman, MHong, HDarwish, ISSingh, RYu, JBorzilleri, RMVelaparthi, ULiu, PDarne, CRahaman, HWarrier, JS TGF-beta inhibitors US Patent US9884868 Publication Date 2/6/2018
 
TGF-beta receptor type-1
Name:TGF-beta receptor type-1
Type:enzyme
Mol. Mass.:55968.24
Organism:Homo sapiens (Human)
Description:P36897
Residue:503
BDBM282907
NameBDBM282907
Synonyms:6-(1-ethyl-4-(4-fluorophenyl)-1H-imidazol-5- yl)imidazo[1,2-b]pyridazine-3-carboxamide US11352360, Example 112' | US9884868, Example 112'
TypeSmall organic molecule
Emp. Form.C18H15FN6O
Mol. Mass.350.3497
SMILESCCn1cnc(c1-c1ccc2ncc(C(N)=O)n2n1)-c1ccc(F)cc1