Reaction Details
TargetTGF-beta receptor type-1
LigandBDBM283004
Substrate/Competitorn/a
Meas. Tech.Biological Assay
pH7.4±n/a
Temperature298.15±n/a K
IC50 0.900±n/a nM
Commentsextracted
Citation Kinsella, TGelman, MHong, HDarwish, ISSingh, RYu, JBorzilleri, RMVelaparthi, ULiu, PDarne, CRahaman, HWarrier, JS TGF-beta inhibitors US Patent US9884868 Publication Date 2/6/2018
 
TGF-beta receptor type-1
Name:TGF-beta receptor type-1
Type:enzyme
Mol. Mass.:55968.24
Organism:Homo sapiens (Human)
Description:P36897
Residue:503
BDBM283004
NameBDBM283004
Synonyms:6-(1-(2,2-difluoroethyl)-4-(4-fluorophenyl)-1H- imidazol-5-yl)-N-methylimidazo[1,2-b]pyridazine-3- carboxamide US11352360, Example 206' | US9884868, Example 206'
TypeSmall organic molecule
Emp. Form.C19H15F3N6O
Mol. Mass.400.3572
SMILESCNC(=O)c1cnc2ccc(nn12)-c1c(ncn1CC(F)F)-c1ccc(F)cc1