Reaction Details
TargetPhosphatidylinositol 4,5-bisphosphate 3-kinase catalytic subunit delta isoform
LigandBDBM117068
Substrate/Competitorn/a
Meas. Tech.Competitive Assay
IC50<1000±n/a nM
Citation Lee, GLim, CSCho, HWSeo, JGyorkos, ACCho, SYChoi, EKKim, CSHwang, JJ Pyridopyrimidine derivatives and use thereof US Patent US8664230 Publication Date 3/4/2014
 
Phosphatidylinositol 4,5-bisphosphate 3-kinase catalytic subunit delta isoform
Name:Phosphatidylinositol 4,5-bisphosphate 3-kinase catalytic subunit delta isoform
Type:Enzyme Subunit
Mol. Mass.:119489.41
Organism:Homo sapiens (Human)
Description:O00329
Residue:1044
BDBM117068
NameBDBM117068
Synonyms:US8664230, 4
TypeSmall organic molecule
Emp. Form.C24H21ClF2N6O3S
Mol. Mass.546.977
SMILESCN1CCC(CC1)Oc1ncnc2ccc(nc12)-c1cnc(Cl)c(NS(=O)(=O)c2ccc(F)cc2F)c1