Reaction Details
TargetAldehyde dehydrogenase, mitochondrial
LigandBDBM118212
Substrate/Competitorn/a
Meas. Tech.ALDH2 Assay
pH7.4±n/a
IC50 15±n/a nM
Commentsextracted
Citation Graupe, MVenkataramani, CZablocki, J ALDH-2 inhibitors in the treatment of addiction US Patent US8673966 Publication Date 3/18/2014
 
Aldehyde dehydrogenase, mitochondrial
Name:Aldehyde dehydrogenase, mitochondrial
Type:Enzyme
Mol. Mass.:56382.67
Organism:Homo sapiens (Human)
Description:P05091
Residue:517
BDBM118212
NameBDBM118212
Synonyms:US8673966, N-(4-(7-((1,2-dimethyl-1H-imidazol-5- yl)ethynyl)-4-oxo-4H-chromen-3-yl)phenyl)methanesulfonamide
Typen/a
Emp. Form.C23H19N3O4S
Mol. Mass.433.48
SMILESCc1ncc(C#Cc2ccc3c(c2)occ(-c2ccc(NS(C)(=O)=O)cc2)c3=O)n1C