Reaction Details
TargetProlyl hydroxylase EGLN2
LigandBDBM118329
Substrate/Competitorn/a
Meas. Tech.Inhibition Assay
IC50 500±n/a nM
Citation Thede, KFlamme, IOehme, FErgüden, JStoll, FSchuhmacher, JWild, HKolkhof, PBeck, HKeldenich, JAkbaba, MJeske, M Substituted dihydropyrazolones for treating cardiovascular and hematological diseases US Patent US8653111 Publication Date 2/18/2014
 
Prolyl hydroxylase EGLN2
Name:Prolyl hydroxylase EGLN2
Type:Protein
Mol. Mass.:43657.01
Organism:Homo sapiens (Human)
Description:Q96KS0
Residue:407
BDBM118329
NameBDBM118329
Synonyms:US8653111, 10
TypeSmall organic molecule
Emp. Form.C15H17N7O
Mol. Mass.311.3418
SMILESO=c1c(c[nH]n1-c1cc(ncn1)N1CCCCC1)-n1ccnc1