Reaction Details
TargetProlyl hydroxylase EGLN2
LigandBDBM118332
Substrate/Competitorn/a
Meas. Tech.Inhibition Assay
IC50 1800±n/a nM
Citation Thede, KFlamme, IOehme, FErgüden, JStoll, FSchuhmacher, JWild, HKolkhof, PBeck, HKeldenich, JAkbaba, MJeske, M Substituted dihydropyrazolones for treating cardiovascular and hematological diseases US Patent US8653111 Publication Date 2/18/2014
 
Prolyl hydroxylase EGLN2
Name:Prolyl hydroxylase EGLN2
Type:Protein
Mol. Mass.:43657.01
Organism:Homo sapiens (Human)
Description:Q96KS0
Residue:407
BDBM118332
NameBDBM118332
Synonyms:US8653111, 43
TypeSmall organic molecule
Emp. Form.C10H9N7O
Mol. Mass.243.2248
SMILESCc1cn(nn1)-c1c[nH]n(-c2cnccn2)c1=O