Reaction Details
TargetProlyl hydroxylase EGLN2
LigandBDBM118336
Substrate/Competitorn/a
Meas. Tech.Inhibition Assay
IC50 1400±n/a nM
Citation Thede, KFlamme, IOehme, FErgüden, JStoll, FSchuhmacher, JWild, HKolkhof, PBeck, HKeldenich, JAkbaba, MJeske, M Substituted dihydropyrazolones for treating cardiovascular and hematological diseases US Patent US8653111 Publication Date 2/18/2014
 
Prolyl hydroxylase EGLN2
Name:Prolyl hydroxylase EGLN2
Type:Protein
Mol. Mass.:43657.01
Organism:Homo sapiens (Human)
Description:Q96KS0
Residue:407
BDBM118336
NameBDBM118336
Synonyms:US8653111, 60
TypeSmall organic molecule
Emp. Form.C13H11F3N6O
Mol. Mass.324.2612
SMILESCCc1cc(ncn1)-n1[nH]cc(-n2cnc(c2)C(F)(F)F)c1=O