Reaction Details
TargetProlyl hydroxylase EGLN2
LigandBDBM118340
Substrate/Competitorn/a
Meas. Tech.Inhibition Assay
IC50 1900±n/a nM
Citation Thede, KFlamme, IOehme, FErgüden, JStoll, FSchuhmacher, JWild, HKolkhof, PBeck, HKeldenich, JAkbaba, MJeske, M Substituted dihydropyrazolones for treating cardiovascular and hematological diseases US Patent US8653111 Publication Date 2/18/2014
 
Prolyl hydroxylase EGLN2
Name:Prolyl hydroxylase EGLN2
Type:Protein
Mol. Mass.:43657.01
Organism:Homo sapiens (Human)
Description:Q96KS0
Residue:407
BDBM118340
NameBDBM118340
Synonyms:US8653111, 83
TypeSmall organic molecule
Emp. Form.C11H7F3N6O
Mol. Mass.296.2081
SMILESFC(F)(F)c1ccnc(c1)-n1[nH]cc(-n2ccnn2)c1=O