Reaction Details
TargetProlyl hydroxylase EGLN2
LigandBDBM118343
Substrate/Competitorn/a
Meas. Tech.Inhibition Assay
IC50 1700±n/a nM
Citation Thede, KFlamme, IOehme, FErgüden, JStoll, FSchuhmacher, JWild, HKolkhof, PBeck, HKeldenich, JAkbaba, MJeske, M Substituted dihydropyrazolones for treating cardiovascular and hematological diseases US Patent US8653111 Publication Date 2/18/2014
 
Prolyl hydroxylase EGLN2
Name:Prolyl hydroxylase EGLN2
Type:Protein
Mol. Mass.:43657.01
Organism:Homo sapiens (Human)
Description:Q96KS0
Residue:407
BDBM118343
NameBDBM118343
Synonyms:US8653111, 101
TypeSmall organic molecule
Emp. Form.C13H13N7O2
Mol. Mass.299.288
SMILESOC1CN(C1)c1cc(ncn1)-n1[nH]cc(-n2ccnc2)c1=O