Reaction Details
TargetProlyl hydroxylase EGLN2
LigandBDBM118344
Substrate/Competitorn/a
Meas. Tech.Inhibition Assay
IC50 350±n/a nM
Citation Thede, KFlamme, IOehme, FErgüden, JStoll, FSchuhmacher, JWild, HKolkhof, PBeck, HKeldenich, JAkbaba, MJeske, M Substituted dihydropyrazolones for treating cardiovascular and hematological diseases US Patent US8653111 Publication Date 2/18/2014
 
Prolyl hydroxylase EGLN2
Name:Prolyl hydroxylase EGLN2
Type:Protein
Mol. Mass.:43657.01
Organism:Homo sapiens (Human)
Description:Q96KS0
Residue:407
BDBM118344
NameBDBM118344
Synonyms:US8653111, 103
TypeSmall organic molecule
Emp. Form.C11H11N7OS
Mol. Mass.289.316
SMILESCCSc1cc(ncn1)-n1[nH]cc(-n2ccnn2)c1=O