Reaction Details
TargetUDP-N-acetylglucosamine 1-carboxyvinyltransferase
LigandBDBM119070
Substrate/Competitorn/a
IC50 1.67e+4±n/a nM
Citation Hrast, MSosic, ISink, RGobec, S Inhibitors of the peptidoglycan biosynthesis enzymes MurA-F. Bioorg Chem55:2-15 (2014) 
 
UDP-N-acetylglucosamine 1-carboxyvinyltransferase
Name:UDP-N-acetylglucosamine 1-carboxyvinyltransferase
Type:Protein
Mol. Mass.:44640.67
Organism:Pseudomonas aeruginosa (G-proteobacteria)
Description:P. aeruginosa MurA
Residue:421
BDBM119070
NameBDBM119070
Synonyms:Cnicin (compound 5)
TypeSmall organic molecule
Emp. Form.C19H24O7
Mol. Mass.364.3897
SMILESOC[C@@H](O)C(=C)C(=O)OC1C\C=C\CC\C(CO)=C\[C@H]2OC(=O)C(=C)[C@H]12