Reaction Details
TargetUDP-N-acetylglucosamine 1-carboxyvinyltransferase
LigandBDBM119073
Substrate/Competitorn/a
IC50 2.8e+2±n/a nM
Citation Hrast, MSosic, ISink, RGobec, S Inhibitors of the peptidoglycan biosynthesis enzymes MurA-F. Bioorg Chem55:2-15 (2014) 
 
UDP-N-acetylglucosamine 1-carboxyvinyltransferase
Name:UDP-N-acetylglucosamine 1-carboxyvinyltransferase
Type:Protein
Mol. Mass.:44814.62
Organism:Escherichia coli K-12 (Enterobacteria)
Description:E. coli MurA
Residue:419
BDBM119073
NameBDBM119073
Synonyms:MurA inhibitor (compound 9)
TypeSmall organic molecule
Emp. Form.C7H2Cl2O3S
Mol. Mass.237.06
SMILESOc1cc(Cl)c2oc(=O)sc2c1Cl