Reaction Details
TargetUDP-N-acetylenolpyruvoylglucosamine reductase
LigandBDBM119077
Substrate/Competitorn/a
IC50 7.7e+3±n/a nM
Citation Hrast, MSosic, ISink, RGobec, S Inhibitors of the peptidoglycan biosynthesis enzymes MurA-F. Bioorg Chem55:2-15 (2014) 
 
UDP-N-acetylenolpyruvoylglucosamine reductase
Name:UDP-N-acetylenolpyruvoylglucosamine reductase
Type:Protein
Mol. Mass.:37848.05
Organism:Escherichia coli K-12 (Enterobacteria)
Description:E. coli MurB
Residue:342
BDBM119077
NameBDBM119077
Synonyms:MurB inhibitor (compound 14)
TypeSmall organic molecule
Emp. Form.C32H36N2O4
Mol. Mass.512.6392
SMILESCCCC[C@@H](C(O)=O)n1c(cn(Cc2ccccc2)c1=O)-c1cccc(Oc2ccc(cc2)C(C)(C)C)c1