Reaction Details
TargetUDP-N-acetylmuramate--L-alanine ligase
LigandBDBM119081
Substrate/Competitorn/a
IC50 49±0.0 nM
Citation Hrast, MSosic, ISink, RGobec, S Inhibitors of the peptidoglycan biosynthesis enzymes MurA-F. Bioorg Chem55:2-15 (2014) 
 
UDP-N-acetylmuramate--L-alanine ligase
Name:UDP-N-acetylmuramate--L-alanine ligase
Type:Protein
Mol. Mass.:53617.78
Organism:Escherichia coli
Description:P17952
Residue:491
BDBM119081
NameBDBM119081
Synonyms:MurC inhibitor (compound 20)
TypeSmall organic molecule
Emp. Form.C22H36N3O21P3
Mol. Mass.771.45
SMILESCC(CP(O)(=O)CO[C@H]1[C@H](O)[C@@H](CO)OC(OP(O)(=O)OP(O)(=O)OC[C@H]2O[C@H]([C@H](O)[C@@H]2O)n2ccc(=O)[nH]c2=O)[C@@H]1NC(C)=O)C(O)=O