Reaction Details
TargetUDP-N-acetylmuramoylalanine--D-glutamate ligase
LigandBDBM119103
Substrate/Competitorn/a
IC50 4.5e+4±n/a nM
Citation Hrast, MSosic, ISink, RGobec, S Inhibitors of the peptidoglycan biosynthesis enzymes MurA-F. Bioorg Chem55:2-15 (2014) 
 
UDP-N-acetylmuramoylalanine--D-glutamate ligase
Name:UDP-N-acetylmuramoylalanine--D-glutamate ligase
Type:Ligase
Mol. Mass.:46963.02
Organism:Escherichia coli (strain K12)
Description:n/a
Residue:438
BDBM119103
NameBDBM119103
Synonyms:MurD inhibitor (compound 45)
TypeSmall organic molecule
Emp. Form.C23H21N3O6S2
Mol. Mass.499.559
SMILESOC(=O)CC[C@@H](NC(=O)c1cccc(CNc2ccc(C=C3SC(S)=NC3=O)cc2)c1)C(O)=O