Reaction Details
TargetUDP-N-acetylmuramoyl-tripeptide--D-alanyl-D-alanine ligase
LigandBDBM119112
Substrate/Competitorn/a
IC50 8e+3±n/a nM
Citation Hrast, MSosic, ISink, RGobec, S Inhibitors of the peptidoglycan biosynthesis enzymes MurA-F. Bioorg Chem55:2-15 (2014) 
 
UDP-N-acetylmuramoyl-tripeptide--D-alanyl-D-alanine ligase
Name:UDP-N-acetylmuramoyl-tripeptide--D-alanyl-D-alanine ligase
Type:Protein
Mol. Mass.:47439.03
Organism:Escherichia coli
Description:P11880
Residue:452
BDBM119112
NameBDBM119112
Synonyms:MurF inhibitor (compound 54)
TypeSmall organic molecule
Emp. Form.C19H22ClN3O3S2
Mol. Mass.439.979
SMILESCCN(CC)S(=O)(=O)c1ccc(Cl)c(c1)C(=O)NC1=C(C#N)C2CCCC2S1