Reaction Details
TargetCytochrome P450 3A4
LigandBDBM119125
Substrate/Competitorn/a
Meas. Tech.Spectral Binding Titrations
pH7.4±n/a
Kd 1.5e+3± 2e+2 nM
Commentsextracted
Citation Sevrioukova, IFPoulos, TL Dissecting cytochrome P450 3A4-ligand interactions using ritonavir analogues. Biochemistry52:4474-81 (2013) 
 
Cytochrome P450 3A4
Name:Cytochrome P450 3A4
Type:Enzyme
Mol. Mass.:57349.57
Organism:Homo sapiens (Human)
Description:n/a
Residue:503
BDBM119125
NameBDBM119125
Synonyms:GS4
TypeSmall organic molecule
Emp. Form.C23H36N6O4S2
Mol. Mass.524.7
SMILESCC(C)[C@H](NC(=O)N(C)Cc1csc(n1)C(C)C)C(=O)NCCCCNC(=O)OCc1cncs1