Reaction Details
TargetCytochrome P450 3A4
LigandBDBM119126
Substrate/Competitorn/a
Meas. Tech.Spectral Binding Titrations
pH7.4±n/a
Kd 7.3e+3± 5e+2 nM
Commentsextracted
Citation Sevrioukova, IFPoulos, TL Dissecting cytochrome P450 3A4-ligand interactions using ritonavir analogues. Biochemistry52:4474-81 (2013) 
 
Cytochrome P450 3A4
Name:Cytochrome P450 3A4
Type:Enzyme
Mol. Mass.:57349.57
Organism:Homo sapiens (Human)
Description:n/a
Residue:503
BDBM119126
NameBDBM119126
Synonyms:GS5
TypeSmall organic molecule
Emp. Form.C25H40N6O4S2
Mol. Mass.552.753
SMILESC[C@@H](CC[C@H](C)NC(=O)[C@@H](NC(=O)N(C)Cc1csc(n1)C(C)C)C(C)C)NC(=O)OCc1cncs1