Reaction Details
TargetTrace amine-associated receptor 1
LigandBDBM119143
Substrate/Competitorn/a
Meas. Tech.Radioligand Binding Assay
Ki 0.1±n/a nM
Citation Nettekoven, MNorcross, RPolara, A Dihydrooxazol-2-amine derivatives US Patent US8673950 Publication Date 3/18/2014
 
Trace amine-associated receptor 1
Name:Trace amine-associated receptor 1
Type:Protein
Mol. Mass.:37635.41
Organism:Mus musculus (Mouse)
Description:Q923Y8
Residue:332
BDBM119143
NameBDBM119143
Synonyms:US8673950, 10
TypeSmall organic molecule
Emp. Form.C19H20F3N3O2
Mol. Mass.379.3762
SMILESCc1cc(Nc2ccc(CC[C@H]3COC(N)=N3)cc2)ccc1OC(F)(F)F