Reaction Details
TargetP2Y purinoceptor 12
LigandBDBM119427
Substrate/Competitorn/a
Meas. Tech.Binding Assay
IC50 5±n/a nM
Citation Nazare, MZech, GJust, MWeiss, THessler, GCzech, J Quinoline-carboxamide derivatives as P2Y12 antagonists US Patent US8669266 Publication Date 3/11/2014
 
P2Y purinoceptor 12
Name:P2Y purinoceptor 12
Type:Enzyme
Mol. Mass.:39458.48
Organism:Homo sapiens (Human)
Description:Q9H244
Residue:342
BDBM119427
NameBDBM119427
Synonyms:US8669266, 490
TypeSmall organic molecule
Emp. Form.C36H48N6O9
Mol. Mass.708.8011
SMILESCCCOC(=O)N1CCN(CC1)C(=O)[C@H](CCC(=O)OC)NC(=O)c1cc(OCC(=O)N2CCC[C@H]2C(=O)NC2CCC2)c2ccc(C)cc2n1