Reaction Details
TargetP2Y purinoceptor 12
LigandBDBM119430
Substrate/Competitorn/a
Meas. Tech.Binding Assay
IC50 8±n/a nM
Citation Nazare, MZech, GJust, MWeiss, THessler, GCzech, J Quinoline-carboxamide derivatives as P2Y12 antagonists US Patent US8669266 Publication Date 3/11/2014
 
P2Y purinoceptor 12
Name:P2Y purinoceptor 12
Type:Enzyme
Mol. Mass.:39458.48
Organism:Homo sapiens (Human)
Description:Q9H244
Residue:342
BDBM119430
NameBDBM119430
Synonyms:US8669266, 600
TypeSmall organic molecule
Emp. Form.C36H48N10O7
Mol. Mass.732.8291
SMILESCCCCOC(=O)N1CCN(CC1)C(=O)[C@H](CCc1nnn[nH]1)NC(=O)c1cc(OCC(=O)N2CCC[C@H]2C(=O)NC2CCC2)c2ccc(C)cc2n1