Reaction Details
TargetProstaglandin E2 receptor EP2 subtype
LigandBDBM119436
Substrate/Competitorn/a
Meas. Tech.Binding Assay
pH6±n/a
Temperature303.15±n/a K
Ki 4.4±n/a nM
Commentsextracted
Citation Hagihara, MYoneda, KOkanari, EShigetomi, M Medical composition for treatment or prophylaxis of glaucoma US Patent US8685986 Publication Date 4/1/2014
 
Prostaglandin E2 receptor EP2 subtype
Name:Prostaglandin E2 receptor EP2 subtype
Type:Enzyme
Mol. Mass.:39775.71
Organism:Homo sapiens (Human)
Description:P43116
Residue:358
BDBM119436
NameBDBM119436
Synonyms:US8685986, 9
TypeSmall organic molecule
Emp. Form.C23H19N3O5
Mol. Mass.417.4141
SMILESONC(=O)c1ccc(CNC(=O)c2[nH]c(cc2-c2ccc(O)cc2)-c2ccoc2)cc1