Reaction Details
TargetProstaglandin E2 receptor EP2 subtype
LigandBDBM119441
Substrate/Competitorn/a
Meas. Tech.Binding Assay
pH6±n/a
Temperature303.15±n/a K
Ki 3.1±n/a nM
Commentsextracted
Citation Hagihara, MYoneda, KOkanari, EShigetomi, M Medical composition for treatment or prophylaxis of glaucoma US Patent US8685986 Publication Date 4/1/2014
 
Prostaglandin E2 receptor EP2 subtype
Name:Prostaglandin E2 receptor EP2 subtype
Type:Enzyme
Mol. Mass.:39775.71
Organism:Homo sapiens (Human)
Description:P43116
Residue:358
BDBM119441
NameBDBM119441
Synonyms:US8685986, 16
TypeSmall organic molecule
Emp. Form.C23H19N3O5
Mol. Mass.417.4141
SMILESCOc1ccc(cc1)-c1cc([nH]c1C(=O)Nc1ccc(o1)C(=O)NO)-c1ccccc1