Reaction Details
TargetArachidonate 5-lipoxygenase-activating protein
LigandBDBM168701
Substrate/Competitorn/a
Meas. Tech.Binding Assay
Ki 1.000±n/a nM
Citation Bacani, GMEccles, WFitzgerald, AEGoldberg, SDHack, MDHawryluk, NAJones, WMKeith, JMKrawczuk, PLebsack, ADLee-Dutra, ALiu, JMcClure, KJMeduna, SPPippel, DJRosen, MDSales, ZS FLAP modulators US Patent US9884878 Publication Date 2/6/2018
 
Arachidonate 5-lipoxygenase-activating protein
Name:Arachidonate 5-lipoxygenase-activating protein
Type:Enzyme
Mol. Mass.:18159.90
Organism:Homo sapiens (Human)
Description:P20292
Residue:161
BDBM168701
NameBDBM168701
Synonyms:US9079866, 78 US9884878, Compound 78
TypeSmall organic molecule
Emp. Form.C25H23FN4O4S
Mol. Mass.494.538
SMILESNc1cnc(cn1)-c1ccc(cc1F)-c1ccccc1S(=O)(=O)N[C@@H](CO)[C@@H](O)c1ccccc1