Reaction Details
TargetDNA primase
LigandBDBM50336799
Substrate/Competitorn/a
Meas. Tech.Quatitative Inhibition Analysis Assay
pH8.8±n/a
IC50 8.2e+3± 1.3e+3 nM
Commentsextracted
Citation Biswas, TGreen, KDGarneau-Tsodikova, STsodikov, OV Discovery of inhibitors of Bacillus anthracis primase DnaG. Biochemistry52:6905-10 (2013) 
 
DNA primase
Name:DNA primase
Synonyms:DNA primase (Ba DnaG)
Type:Protein
Mol. Mass.:68258.37
Organism:Bacillus anthracis (Firmicutes)
Description:A0A6L8PXB3
Residue:598
BDBM50336799
NameBDBM50336799
TypeSmall organic molecule
Emp. Form.C51H40N6O23S6
Mol. Mass.1297.28
SMILESCc1ccc(cc1NC(=O)c1cccc(NC(=O)Nc2cccc(c2)C(=O)Nc2cc(ccc2C)C(=O)Nc2ccc(c3cc(cc(c23)S(O)(=O)=O)S(O)(=O)=O)S(O)(=O)=O)c1)C(=O)Nc1ccc(c2cc(cc(c12)S(O)(=O)=O)S(O)(=O)=O)S(O)(=O)=O