Reaction Details
TargetEnoyl-acyl carrier reductase ENR
LigandBDBM25403
Substrate/Competitorn/a
Meas. Tech.TgENR Inhibition Assay
pH7.5±n/a
IC50 24±0.0 nM
Commentsextracted
Citation Afanador, GAMuench, SPMcPhillie, MFomovska, ASchön, ASchön, YCheng, GStec, JFreundlich, JSShieh, HMAnderson, JWJacobus, DPFidock, DAKozikowski, APFishwick, CWRice, DWFreire, EMcLeod, RPrigge, ST Discrimination of potent inhibitors of Toxoplasma gondii enoyl-acyl carrier protein reductase by a thermal shift assay. Biochemistry52:9155-66 (2013) 
 
Enoyl-acyl carrier reductase ENR
Name:Enoyl-acyl carrier reductase ENR
Type:PROTEIN
Mol. Mass.:43663.67
Organism:Toxoplasma gondii
Description:ChEMBL_1290812
Residue:417
BDBM25403
NameBDBM25403
Synonyms:4‐(2,4‐dichlorophenoxy)‐3‐hydroxybenzonitrile (19) Triclosan derivative, 4
TypeSmall organic molecule
Emp. Form.C13H7Cl2NO2
Mol. Mass.280.106
SMILESOc1cc(ccc1Oc1ccc(Cl)cc1Cl)C#N