Reaction Details
TargetEnoyl-acyl carrier reductase ENR
LigandBDBM119871
Substrate/Competitorn/a
Meas. Tech.TgENR Inhibition Assay
pH7.5±n/a
IC50 100±0.0 nM
Commentsextracted
Citation Afanador, GAMuench, SPMcPhillie, MFomovska, ASchön, ASchön, YCheng, GStec, JFreundlich, JSShieh, HMAnderson, JWJacobus, DPFidock, DAKozikowski, APFishwick, CWRice, DWFreire, EMcLeod, RPrigge, ST Discrimination of potent inhibitors of Toxoplasma gondii enoyl-acyl carrier protein reductase by a thermal shift assay. Biochemistry52:9155-66 (2013) 
 
Enoyl-acyl carrier reductase ENR
Name:Enoyl-acyl carrier reductase ENR
Type:PROTEIN
Mol. Mass.:43663.67
Organism:Toxoplasma gondii
Description:ChEMBL_1290812
Residue:417
BDBM119871
NameBDBM119871
Synonyms:N‐{[3‐chloro‐4‐(4‐chloro‐2‐ hydroxyphenoxy)phenyl]methyl}‐5‐methyl‐1,2‐oxazole‐3‐ carboxamide (29)
TypeSmall organic molecule
Emp. Form.C18H14Cl2N2O4
Mol. Mass.393.221
SMILESCc1cc(no1)C(=O)NCc1ccc(Oc2ccc(Cl)cc2O)c(Cl)c1