Reaction Details
TargetEnoyl-acyl carrier reductase ENR
LigandBDBM50431923
Substrate/Competitorn/a
Meas. Tech.TgENR Inhibition Assay
pH7.5±n/a
IC50 41±0.0 nM
Commentsextracted
Citation Afanador, GAMuench, SPMcPhillie, MFomovska, ASchön, ASchön, YCheng, GStec, JFreundlich, JSShieh, HMAnderson, JWJacobus, DPFidock, DAKozikowski, APFishwick, CWRice, DWFreire, EMcLeod, RPrigge, ST Discrimination of potent inhibitors of Toxoplasma gondii enoyl-acyl carrier protein reductase by a thermal shift assay. Biochemistry52:9155-66 (2013) 
 
Enoyl-acyl carrier reductase ENR
Name:Enoyl-acyl carrier reductase ENR
Type:PROTEIN
Mol. Mass.:43663.67
Organism:Toxoplasma gondii
Description:ChEMBL_1290812
Residue:417
BDBM50431923
NameBDBM50431923
Synonyms:5‐chloro‐2‐(naphthalen‐2‐yloxy)phenol (30) | CHEMBL2347845
TypeSmall organic molecule
Emp. Form.C16H11ClO2
Mol. Mass.270.71
SMILESOc1cc(Cl)ccc1Oc1ccc2ccccc2c1