Reaction Details
TargetEnoyl-acyl carrier reductase ENR
LigandBDBM50431922
Substrate/Competitorn/a
Meas. Tech.TgENR Inhibition Assay
pH7.5±n/a
IC50 30±0.0 nM
Commentsextracted
Citation Afanador, GAMuench, SPMcPhillie, MFomovska, ASchön, ASchön, YCheng, GStec, JFreundlich, JSShieh, HMAnderson, JWJacobus, DPFidock, DAKozikowski, APFishwick, CWRice, DWFreire, EMcLeod, RPrigge, ST Discrimination of potent inhibitors of Toxoplasma gondii enoyl-acyl carrier protein reductase by a thermal shift assay. Biochemistry52:9155-66 (2013) 
 
Enoyl-acyl carrier reductase ENR
Name:Enoyl-acyl carrier reductase ENR
Type:PROTEIN
Mol. Mass.:43663.67
Organism:Toxoplasma gondii
Description:ChEMBL_1290812
Residue:417
BDBM50431922
NameBDBM50431922
Synonyms:5‐chloro‐2‐[2‐chloro‐4‐ (trifluoromethyl)phenoxy]phenol (31) | CHEMBL2347846
TypeSmall organic molecule
Emp. Form.C13H7Cl2F3O2
Mol. Mass.323.095
SMILESOc1cc(Cl)ccc1Oc1ccc(cc1Cl)C(F)(F)F