Reaction Details
TargetMyeloperoxidase
LigandBDBM119874
Substrate/Competitorn/a
Meas. Tech.MPO Activity Assay
pH7.4±n/a
Ki 429±120 nM
Commentsextracted
Citation Ward, JSpath, SNPabst, BCarpino, PARuggeri, RBXing, GSpeers, AECravatt, BFAhn, K Mechanistic characterization of a 2-thioxanthine myeloperoxidase inhibitor and selectivity assessment utilizing click chemistry--activity-based protein profiling. Biochemistry52:9187-201 (2013) 
 
Myeloperoxidase
Name:Myeloperoxidase
Type:Enzyme
Mol. Mass.:83888.32
Organism:Homo sapiens (Human)
Description:P05164
Residue:745
BDBM119874
NameBDBM119874
Synonyms:3‐[(2S)‐2‐ethoxypropyl]‐2‐sulfanylidene‐1,9‐ dihydropurin‐6‐one (D)
TypeSmall organic molecule
Emp. Form.C10H14N4O2S
Mol. Mass.254.309
SMILESCCO[C@@H](C)Cn1c2nc[nH]c2c(=O)[nH]c1=S